{"text_format":"1","workbook":"xlsx","n_sheets":10,"sheets":["Instructions (Please Read)","Budget Summary","Revenue","Expenditures","Cash & Investments","Additional Details","Notes","Tasks","Formula Map","Sheet1"],"not_rendered":{"charts":0,"images":7,"macros":1,"external_links":0,"defined_names":48,"comments":1,"pivot_tables":0},"unopened":[],"bounds":{"document_bytes":16777216,"sheet_cells":100000,"rows_first":2000,"rows_last":500,"rows_between":2000,"halvings":0,"cell_chars":16384,"cell_head_chars":4096},"cells_cut":0,"cells_raw":0,"read":"whole","date_system":"1900"}

{"sheet":"Instructions (Please Read)","index":0,"n_rows":267,"n_cols":22,"rows_kept":267,"cut":false,"hidden":false,"merged":[[26,1,26,12],[7,1,7,12],[0,1,0,12],[22,1,22,12],[20,1,20,12],[14,2,14,11],[15,2,15,12],[17,2,17,12],[13,2,13,10],[12,2,12,11],[10,2,10,11],[8,1,8,12],[24,1,24,12]]}
[null,{"$f":"VLOOKUP(U2,R1:S5,2,FALSE)","v":"Proposed Budget"},null,null,null,null,null,null,null,null,null,null,null,null,"This budget form is currently dated for the Fiscal Year Ending","If the date is wrong, change the year below.",null,1,"Proposed Budget"]
[null,null,null,null,null,null,null,null,null,null,null,null,null,null,{"$f":" DATE(P2,6,30)","v":"2024-06-30"},{"$f":"YEAR(NOW())+1","v":2024},null,2,"Final Budget",null,1]
[null,null,null,null,null,null,null,null,null,null,null,null,null,null,null,{"$f":"YEAR(NOW())+1","v":2024},null,3,"Amended Budget",null,1,0]
[]
[]
[]
[null,null,null,null,null,null,null,null,null,null,null,null,null,null,null,null,null,null,{"$f":"YEAR(NOW())+1","v":2024}]
[null,"INSTRUCTIONS FOR COMPLETING BUDGET REQUEST FORM "]
[null,"In accordance with the requirements of WS 16-12-403, the Department of Audit has modified the Standard Budget Form.  "]
[]
[null,"1.","Please follow the steps below:"]
[null,null,"a.  Download this as an Excel file and save to your computer."]
[null,null,"b.  Begin by reading this instruction sheet and continue by inputting data on the following worksheets (Tabs are along the bottom of the page).  This will automatically fill results to the \"Budget Summary\" sheet."]
[null,null,"c. Enter all required information at the top of the Budget Summary sheet (Name, County, District address, District phone, FYE, Your name, Date, Location, and Time of Budget Hearing)."]
[null,null,"You cannot enter data into cells shaded in gray as they are automatic totals."]
[null,"2.","Choose, in the drop-down box at the top of this page, which budget (\"proposed\" or \"final\") you intend to submit at this time.  Note:  If you are preparing a proposed budget the \"Final Budget\" column will be crossed out. "]
[null,"3.","In places you are asked to identify a specific item, please describe it in detail. SAVE THE EXCEL FILE AS YOU WILL NEED IT LATER."]
[null,"4.","For EACH budget form prepared (Proposed or Final) you will click the \"Create a PDF\" button on the Budget Summary page.  This will save a copy of the budget in your folder in .pdf format.  The saved copy of the budget will then need to be submitted via email to your county government AND to the Wyoming Department of Audit at doa-pfd-web@wyo.gov."]
[null,"5.","If you have ANY questions, or concerns, please contact the Public Funds Division at 307-777-7798."]
[]
{"$rows_left_out":248}
{"sheet":"Budget Summary","index":1,"n_rows":167,"n_cols":28,"rows_kept":167,"cut":false,"hidden":false,"merged":[[34,1,62,10],[154,13,155,14],[31,8,31,10],[31,1,31,5],[120,1,120,6],[108,1,108,6],[130,1,130,6],[134,1,134,6],[73,1,73,3],[74,1,74,3],[75,1,75,3],[76,1,76,3],[77,1,77,3],[78,1,78,3],[79,1,79,3],[80,1,80,3],[2,1,2,10],[4,1,4,5],[5,1,5,5],[6,1,6,5],[4,8,4,10],[5,8,5,10],[6,8,6,10],[3,8,3,10],[165,1,165,10],[93,1,93,10],[156,1,156,7],[155,7,155,9],[155,1,155,6],[161,3,161,5],[163,1,163,2],[163,3,163,5],[160,7,160,8],[160,1,160,2],[160,3,160,5],[160,9,160,10],[64,1,67,10],[82,1,82,3],[85,1,85,10],[88,1,88,10],[91,1,91,10],[69,1,69,3],[73,7,73,10],[74,7,74,10],[75,7,75,10],[72,7,72,10],[81,1,81,3],[70,1,70,3],[71,1,71,3],[72,1,72,3]]}
[null,null,null,null,null,null,null,null,null,null,null,"New Column:",null,null,null,null,null,null,null,null,null,null,null,null,null,null,null,"Yes"]
[null,{"$f":"\"FY \"&TEXT(DATE('Instructions (Please Read)'!$P$2-1,7,1),\"m/d/y\")&\"-\"&TEXT(DATE('Instructions (Please Read)'!$P$2,6,30),\"m/d/y\")","v":"FY 7/1/23-6/30/24"},null,null,null,null,{"$f":"VLOOKUP('Instructions (Please Read)'!U2,'Instructions (Please Read)'!R1:S8,2,FALSE)","v":"Proposed Budget"},null,null,null,null,null,null,null,null,null,null,null,null,null,null,null,null,null,null,null,null,"No"]
["Name of \n District/Board:",null,null,null,null,null,null,null,null,null,null,null,null,"If you cannot see the pdf button,"]
[null,null,null,null,null,null,null,null,"Budget Hearing Information",null,null,"Date of",null,"save and reopen the excel file."]
["Address:",null,null,null,null,null,null,"Location:",null,null,null,"Amended",null,{"$f":"IF(O5=\"Complete\",\"All District/Board Information is Complete\",IF(K71=\"Yes\",\"Fill in the yellow boxes below. (\"&(COUNTA(B3,B5,B6,B7,B32,I5,I6,I7,I32,B35,B86,B89,B92,B65)+IF(COUNT(A72:A83)>0,1,0)+IF(OR(K71=\"No\",K71=\"Yes\"),1,0))&\" of 16 done)\"&CHAR(10)&\"Office info required below (\"&COUNTA(H73:K76)&\" of 4 done)\",\"Fill in the yellow boxes below. (\"&(COUNTA(B3,B5,B6,B7,B32,I5,I6,I7,I32,B35,B86,B89,B92,B65)+IF(COUNT(A72:A83)>0,1,0)+IF(OR(K71=\"No\",K71=\"Yes\"),1,0))&\" of 16 done)\"&IF(AND(K71=\"No\",OR(K80<>\"Yes\",K80<>\"No\")),CHAR(10)&\"Records Location Needed (Yes or No below in red)\",\"\")))","v":"Fill in the yellow boxes below. (0 of 16 done)"},{"$f":"IF(K71=\"Yes\",IF((COUNTA(H73:K76)+COUNTA(B3,B5,B6,B7,B32,I5,I6,I7,I32,B35,B86,B89,B92,B65)+IF(COUNTA(B72:D83)>0,1,0)+IF(OR(K71=\"No\",K71=\"Yes\"),1,0))=20,\"Complete\",\"Incomplete\"),IF(K71=\"No\",IF((COUNTA(B3,B5,B6,B7,B32,I5,I6,I7,I32,B35,B86,B89,B92,B65)+IF(COUNTA(B72:D83)>0,1,0)+IF(OR(K71=\"No\",K71=\"Yes\"),1,0))=16,\"Complete\",\"Incomplete\"),\"Incomplete\"))","v":"Incomplete"}]
["City, State, Zip:",null,null,null,null,null,null,"Date:",null,null,null,"Budget"]
["District Phone:",null,null,null,null,null,null,"Time:",null,null,null,"Approval:"]
[{"$f":"IF(LEN('Budget Summary'!B7)<7,\"Required ↗\",\"\")","v":"Required ↗"}]
[null,"Albany County"]
[null,"Big Horn County"]
[null,"Campbell County"]
[null,"Carbon County"]
[null,"Converse County"]
[null,"Crook County"]
[null,"Fremont County"]
[null,"Goshen County"]
[null,"Hot Springs County"]
[null,"Johnson County"]
[null,"Laramie County"]
[null,"Lincoln County"]
{"$rows_left_out":148}
{"sheet":"Revenue","index":2,"n_rows":45,"n_cols":12,"rows_kept":45,"cut":false,"hidden":false,"merged":[[33,3,33,4],[2,1,2,4],[3,1,3,4],[0,1,0,11],[43,3,43,5]]}
[null,{"$f":"VLOOKUP('Instructions (Please Read)'!U2,'Instructions (Please Read)'!R1:S8,2,FALSE)","v":"Proposed Budget"}]
[]
[null,{"$f":"IF('Budget Summary'!B3=\"\",\"Please Enter Name on First Page\",'Budget Summary'!B3)","v":"Please Enter Name on First Page"},null,null,null,null,null,null,null,"FYE",{"$f":"'Instructions (Please Read)'!O2","v":"2024-06-30"}]
[null,"NAME OF DISTRICT/BOARD"]
[]
[null,"PROPERTY TAXES AND ASSESSMENTS"]
[]
[null,null,null,null,null,null,"DOA Chart        of Accounts",{"$f":"'Instructions (Please Read)'!$P$2-3&\"-\"&'Instructions (Please Read)'!$P$2-2&\" Actual\"","v":"2021-2022 Actual"},{"$f":"'Instructions (Please Read)'!$P$2-2&\"-\"&'Instructions (Please Read)'!$P$2-1&\" Estimated\"","v":"2022-2023 Estimated"},{"$f":"'Instructions (Please Read)'!$P$2-1&\"-\"&'Instructions (Please Read)'!$P$2&\" Proposed\"","v":"2023-2024 Proposed"},{"$f":"IF('Instructions (Please Read)'!$B$1=\"Proposed Budget\",\"Pending Approval\",\"Final Approval\")","v":"Pending Approval"},"Amended Budget"]
[null,"R-1","Property Taxes and Assessments Received"]
["H-1","R-1.1","Tax Levy (From the County Treasurer)",null,null,null,4001,null,null,null,{"$f":"J10","v":0},{"$f":"K10","v":0}]
["H-2","R-1.2","Other County Support (see note on the right)",null,null,null,4005,null,null,null,{"$f":"J11","v":0},{"$f":"K11","v":0}]
[]
[null,"FORECASTED REVENUE"]
[]
[null,null,null,null,null,null,"DOA Chart        of Accounts",{"$f":"'Instructions (Please Read)'!$P$2-3&\"-\"&'Instructions (Please Read)'!$P$2-2&\" Actual\"","v":"2021-2022 Actual"},{"$f":"'Instructions (Please Read)'!$P$2-2&\"-\"&'Instructions (Please Read)'!$P$2-1&\" Estimated\"","v":"2022-2023 Estimated"},{"$f":"'Instructions (Please Read)'!$P$2-1&\"-\"&'Instructions (Please Read)'!$P$2&\" Proposed\"","v":"2023-2024 Proposed"},{"$f":"IF('Instructions (Please Read)'!$B$1=\"Proposed Budget\",\"Pending Approval\",\"Final Approval\")","v":"Pending Approval"},"Amended Budget"]
["G-1","R-2","Revenues from Other Governments"]
["G-1.1","R-2.1","State Aid",null,null,null,4211,null,null,null,{"$f":"J17","v":0},0]
["G-1.2","R-2.2","Additional County Aid (non-treasurer)",null,null,null,4237,null,null,null,0,0]
["G-1.3","R-2.3","City (or Town) Aid",null,null,null,4237,null,null,null,0,0]
["G-1.4","R-2.4","Other (Specify)",null,null,null,4237,null,null,null,0,0]
{"$rows_left_out":26}
{"sheet":"Expenditures","index":3,"n_rows":137,"n_cols":14,"rows_kept":137,"cut":false,"hidden":false,"merged":[[0,1,0,11],[8,2,8,3],[132,2,132,3],[23,2,23,3],[31,2,31,3],[38,2,38,3],[30,3,30,4],[37,3,37,4],[62,2,62,3],[15,3,15,4],[19,2,19,3],[68,3,68,4],[74,3,74,4],[75,2,75,4],[44,3,44,4],[53,3,53,4],[114,3,114,4],[124,3,124,4],[92,3,92,4],[98,3,98,4],[1,1,1,4],[2,1,2,4],[80,3,80,4],[81,2,81,4],[56,1,56,11],[57,1,57,4],[102,1,102,4],[101,1,101,10],[86,3,86,4]]}
[null,{"$f":"VLOOKUP('Instructions (Please Read)'!$U$2,'Instructions (Please Read)'!$R$1:$S$8,2,FALSE)","v":"Proposed Budget"}]
[null,{"$f":"IF('Budget Summary'!$B$3=\"\",\"Please Enter Name on First Page\",'Budget Summary'!$B$3)","v":"Please Enter Name on First Page"},null,null,null,null,null,null,null,"FYE",{"$f":"'Instructions (Please Read)'!$O$2","v":"2024-06-30"}]
[null,"NAME OF DISTRICT/BOARD"]
[]
[]
[null,"CAPITAL OUTLAY BUDGET"]
[]
[null,null,null,null,null,null,"DOA Chart of Accounts",{"$f":"'Instructions (Please Read)'!$P$2-3&\"-\"&'Instructions (Please Read)'!$P$2-2&\" Actual\"","v":"2021-2022 Actual"},{"$f":"'Instructions (Please Read)'!$P$2-2&\"-\"&'Instructions (Please Read)'!$P$2-1&\" Estimated\"","v":"2022-2023 Estimated"},{"$f":"'Instructions (Please Read)'!$P$2-1&\"-\"&'Instructions (Please Read)'!$P$2&\" Proposed\"","v":"2023-2024 Proposed"},{"$f":"IF('Instructions (Please Read)'!$B$1=\"Proposed Budget\",\"Pending Approval\",\"Final Approval\")","v":"Pending Approval"},"Amended Budget"]
["E-1","E-1","Capital Outlay"]
["E-1.1","E-1.1","Real Property",null,null,null,6201,null,null,null,{"$f":"J10","v":0},0]
["E-1.2","E-1.2","Vehicles",null,null,null,6210,null,null,null,0,0]
["E-1.3","E-1.3","Office Equipment",null,null,null,6211,null,null,null,0,0]
["E-1.4","E-1.4","Other (Specify) "]
["E-1.5","E-1.5",null,null,null,null,6200,null,null,null,{"$f":"J14","v":0},{"$f":"K14","v":0}]
["E-1.6","E-1.6",null,null,null,null,6200,null,null,null,{"$f":"J15","v":0},{"$f":"K15","v":0}]
[{"$f":"IF(SUM(G16:J16)=0,\"\",\"E-1.7\")","v":""},"E-1.7",null,{"$f":"IF(SUM(H16:K16)=0,\"\",\"see additional details\")","v":""},null,null,null,{"$f":"IF('Additional Details'!N20=0,\"\",'Additional Details'!N20)","v":""},{"$f":"IF('Additional Details'!O20=0,\"\",'Additional Details'!O20)","v":""},{"$f":"IF('Additional Details'!P20=0,\"\",'Additional Details'!P20)","v":""},{"$f":"IF('Additional Details'!Q20=0,\"\",'Additional Details'!Q20)","v":""},{"$f":"IF('Additional Details'!R20=0,\"\",'Additional Details'!R20)","v":""}]
["E-2","E-1.8","TOTAL CAPITAL OUTLAY",null,null,null,null,{"$f":"SUM(H10:H16)","v":0},{"$f":"SUM(I10:I16)","v":0},{"$f":"SUM(J10:J16)","v":0},{"$f":"SUM(K10:K16)","v":0},{"$f":"SUM(L10:L16)","v":0}]
[]
[]
[]
{"$rows_left_out":118}
{"sheet":"Cash & Investments","index":4,"n_rows":68,"n_cols":12,"rows_kept":68,"cut":false,"hidden":false,"merged":[[0,1,0,11],[27,5,27,6],[35,2,35,4],[35,5,35,6],[51,2,51,4],[51,5,51,6],[45,2,45,4],[45,5,45,6],[34,3,34,4],[32,3,32,4],[33,3,33,4],[47,2,47,5],[48,3,48,4],[49,3,49,4],[43,2,43,4],[43,5,43,6],[67,2,67,5],[50,3,50,4],[53,2,53,5],[63,2,63,5],[65,2,65,5],[59,2,59,4],[61,2,61,4],[61,5,61,6],[64,2,64,4],[64,5,64,6],[59,5,59,6],[37,2,37,6],[1,1,1,4],[2,1,2,4],[31,2,31,6],[29,2,29,4],[29,5,29,6],[27,2,27,4],[8,2,8,3],[9,2,9,3],[10,2,10,3],[13,2,13,5]]}
[null,{"$f":"VLOOKUP('Instructions (Please Read)'!U2,'Instructions (Please Read)'!R1:S8,2,FALSE)","v":"Proposed Budget"}]
[null,{"$f":"IF('Budget Summary'!B3=\"\",\"Please Enter Name on First Page\",'Budget Summary'!B3)","v":"Please Enter Name on First Page"},null,null,null,null,null,null,null,"FYE",{"$f":"'Instructions (Please Read)'!O2","v":"2024-06-30"}]
[null,"NAME OF DISTRICT/BOARD"]
[]
[]
[null,"GENERAL FUNDS"]
[null,null,null,null,null,null,null,"End of Year","Beginning","Beginning"]
[null,"C-1","Balances at Beginning of Fiscal Year",null,null,null,"DOA Chart of Accounts",{"$f":"'Instructions (Please Read)'!$P$2-3&\"-\"&'Instructions (Please Read)'!$P$2-2&\" Actual\"","v":"2021-2022 Actual"},{"$f":"'Instructions (Please Read)'!$P$2-2&\"-\"&'Instructions (Please Read)'!$P$2-1&\" Estimated\"","v":"2022-2023 Estimated"},{"$f":"'Instructions (Please Read)'!$P$2-1&\"-\"&'Instructions (Please Read)'!$P$2&\" Proposed\"","v":"2023-2024 Proposed"},{"$f":"IF('Instructions (Please Read)'!$B$1=\"Proposed Budget\",\"Pending Approval\",\"Final Approval\")","v":"Pending Approval"},"Amended Budget"]
[null,"C-1.1","General Fund Checking Account Balance",null,null,null,1010,null,{"$f":"H9","v":0},null,{"$f":"J9","v":0},0]
[null,"C-1.2","Savings and Investments Account Balance",null,null,null,1040,null,{"$f":"H10","v":0},null,0,0]
[null,"C-1.3","General Fund CD Balance",null,null,null,1050,null,{"$f":"H11","v":0},null,0,0]
[null,"C-1.4","All Other Funds",null,null,null,1020,null,{"$f":"H12","v":0},null,0,0]
[null,"C-1.5","Reserves (From Below)",null,null,null,null,{"$f":"'Budget Summary'!H153","v":0},{"$f":"H13","v":0},{"$f":"'Budget Summary'!J153","v":0},{"$f":"'Budget Summary'!K153","v":0},{"$f":"'Budget Summary'!L153","v":0}]
["G-9","C-1.6","Total Estimated Cash and Investments on Hand",null,null,null,null,{"$f":"SUM(H9:H13)","v":0},{"$f":"SUM(I9:I13)","v":0},{"$f":"SUM(J9:J13)","v":0},{"$f":"SUM(K9:K13)","v":0},{"$f":"SUM(L9:L13)","v":0}]
[]
["G-10","C-2","General Fund Reductions:"]
["G-10.1","C-2.1","a.","Unpaid bills at FYE",null,null,2010,null,null,null,{"$f":"J17","v":0},{"$f":"K17","v":0}]
["G-10.2","C-2.2","b.","Reserves",null,null,null,{"$f":"'Budget Summary'!H153","v":0},{"$f":"'Budget Summary'!I153","v":0},{"$f":"'Budget Summary'!J153","v":0},{"$f":"'Budget Summary'!K153","v":0},{"$f":"'Budget Summary'!L153","v":0}]
["G-10.3","C-2.3",null,"Total Deductions (a+b)",null,null,null,{"$f":"SUM(H17:H18)","v":0},{"$f":"SUM(I17:I18)","v":0},{"$f":"SUM(J17:J18)","v":0},{"$f":"SUM(K17:K18)","v":0},{"$f":"SUM(L17:L18)","v":0}]
["G-11","C-2.4","Estimated Non-Restricted Funds Available",null,null,null,null,{"$f":"+H14-H19","v":0},{"$f":"+I14-I19","v":0},{"$f":"+J14-J19","v":0},{"$f":"+K14-K19","v":0},{"$f":"+L14-L19","v":0}]
{"$rows_left_out":49}
{"sheet":"Additional Details","index":5,"n_rows":208,"n_cols":24,"rows_kept":208,"cut":false,"hidden":false,"merged":[[5,8,6,8],[3,1,3,4],[5,4,6,4],[5,5,6,5],[5,6,6,6],[5,7,6,7]]}
[]
[null,{"$f":"IF('Instructions (Please Read)'!U2=1,\"Proposed Budget\",\"Final Budget\")","v":"Proposed Budget"},null,null,null,null,null,null,null,null,null,"Totals from \nthis Page Only","DOA Chart of Accounts",{"$f":"E6","v":"2021-2022 Actual"},{"$f":"F6","v":"2022-2023 Estimated"},{"$f":"G6","v":"2023-2024 Proposed"},{"$f":"H6","v":"Pending Approval"},{"$f":"I6","v":"Amended Budget"},"Cell below is to check for amount for printer array \"formatting\" macro"]
[null,{"$f":"IF('Budget Summary'!B3=\"\",\"Please Enter Name on First Page\",'Budget Summary'!B3)","v":"Please Enter Name on First Page"},null,null,null,null,"FYE",{"$f":"'Instructions (Please Read)'!O2","v":"2024-06-30"},null,null,"Line","Section",null,null,null,null,null,null,{"$f":"SUM(N5:Q25)","v":0}]
[null,"NAME OF DISTRICT/BOARD",null,null,null,null,null,null,null,null,null,"Administration Budget"]
[null,null,null,"ADDITIONAL DETAILS",null,null,null,null,null,null,"E-2.7","Personnel Services",7005,{"$f":"SUMIF($B$10:$B$140,$S5,E$10:E$140)","v":0},0,0,0,0,{"$f":"CONCATENATE(K5,\" \",L5)","v":"E-2.7 Personnel Services"},null,null,null,"Original Copy Paste"]
[null,null,null,null,{"$f":"'Instructions (Please Read)'!$P$2-3&\"-\"&'Instructions (Please Read)'!$P$2-2&\" Actual\"","v":"2021-2022 Actual"},{"$f":"'Instructions (Please Read)'!$P$2-2&\"-\"&'Instructions (Please Read)'!$P$2-1&\" Estimated\"","v":"2022-2023 Estimated"},{"$f":"'Instructions (Please Read)'!$P$2-1&\"-\"&'Instructions (Please Read)'!$P$2&\" Proposed\"","v":"2023-2024 Proposed"},{"$f":"IF('Instructions (Please Read)'!$B$1=\"Proposed Budget\",\"Pending Approval\",\"Final Approval\")","v":"Pending Approval"},"Amended Budget",null,"E-3.6","Board Expenses",7013,0,0,0,0,0,{"$f":"CONCATENATE(K6,\" \",L6)","v":"E-3.6 Board Expenses"}]
[null,null,null,null,{"$f":"'Instructions (Please Read)'!$P$2-3&\"-\"&'Instructions (Please Read)'!$P$2-2&\" Actual\"","v":"2021-2022 Actual"},{"$f":"'Instructions (Please Read)'!$P$2-2&\"-\"&'Instructions (Please Read)'!$P$2-1&\" Estimated\"","v":"2022-2023 Estimated"},{"$f":"'Instructions (Please Read)'!$P$2-1&\"-\"&'Instructions (Please Read)'!$P$2&\" Proposed\"","v":"2023-2024 Proposed"},{"$f":"IF('Instructions (Please Read)'!$B$1=\"Proposed Budget\",\"Pending Approval\",\"Final Approval\")","v":"Pending Approval"},"Amended Budget",null,"E-4.6","Contractual Services",7023,0,0,0,0,0,{"$f":"CONCATENATE(K7,\" \",L7)","v":"E-4.6 Contractual Services"},null,"Previous Line","All","Section","Subsections"]
[null,"Add to Section",null,"Description","DATA INPUT",null,null,null,null,null,"E-5.8","Other",7035,0,0,0,0,0,{"$f":"CONCATENATE(K8,\" \",L8)","v":"E-5.8 Other"}]
[null,null,null,null,null,null,null,null,null,null,null,"Operations Budget",null,null,null,null,null,null,{"$f":"CONCATENATE(K10,\" \",L10)","v":"E-7.6 Personnel Services"}]
[null,null,{"$f":"HYPERLINK(\"#\"&ADDRESS(ROW(),COLUMN()-1),\"\")","v":""},null,null,null,null,{"$f":"IF(G10=\"\",\"\",G10)","v":""},{"$f":"IF(H10=\"\",\"\",H10)","v":""},null,"E-7.6","Personnel Services",7204,{"$f":"SUMIF($B$10:$B$140,$S9,E$10:E$140)","v":0},0,0,0,0,"E-8.5 Travel",null,null,null,"SCHEDULE B"]
[null,null,"",null,null,null,null,{"$f":"IF(G11=\"\",\"\",G11)","v":""},"",null,"E-8.5","Travel",7212,0,0,0,0,0,"E-9.5 Operating supplies"]
[null,null,"",null,null,null,null,{"$f":"IF(G12=\"\",\"\",G12)","v":""},"",null,"E-9.5","Operating supplies",7220,0,0,0,0,0,"E-10.5 Program Services"]
[null,null,"",null,null,null,null,{"$f":"IF(G13=\"\",\"\",G13)","v":""},"",null,"E-10.5","Program Services",7230,0,0,0,0,0,"E-11.5 Contractual Arrangements",null,null,null,"ACTIVITY"]
[null,null,"",null,null,null,null,{"$f":"IF(G14=\"\",\"\",G14)","v":""},"",null,"E-11.5","Contractual Arrangements",7400,0,0,0,0,0,"E-12.5 Other operations",null,null,"B-1","Personnel Services:"]
[null,null,"",null,null,null,null,{"$f":"IF(G15=\"\",\"\",G15)","v":""},"",null,"E-12.5","Other operations",7450,0,0,0,0,0,{"$f":"CONCATENATE(K17,\" \",L17)","v":"E-14.7 Insurance"},null,null,"B-1.1",null,"Administrator"]
[null,null,"",null,null,null,null,{"$f":"IF(G16=\"\",\"\",G16)","v":""},"",null,null,"Indirect Costs Budget",null,null,null,null,null,null,{"$f":"CONCATENATE(K18,\" \",L18)","v":"E-15.9 Indirect payroll costs"},null,null,"B-1.2",null,"Secretary"]
[null,null,"",null,null,null,null,{"$f":"IF(G17=\"\",\"\",G17)","v":""},"",null,"E-14.7","Insurance",7505,{"$f":"SUMIF($B$10:$B$140,$S15,E$10:E$140)","v":0},0,0,0,0,{"$f":"CONCATENATE(K20,\" \",L20)","v":"E-1.7 Capital Outlay"},null,null,"B-1.3",null,"Clerical"]
[null,null,"",null,null,null,null,{"$f":"IF(G18=\"\",\"\",G18)","v":""},"",null,"E-15.9","Indirect payroll costs",7516,0,0,0,0,0,{"$f":"CONCATENATE(K22,\" \",L22)","v":"R-5.3 Miscellaneous"},null,null,"B-1.4",null,"Other (Specify)"]
[null,null,"",null,null,null,null,{"$f":"IF(G19=\"\",\"\",G19)","v":""},"",null,null,"Capital Outlay Budget",null,null,null,null,null,null,{"$f":"CONCATENATE(K23,\" \",L23)","v":"C-3.9 Sinking & Debt Service Funds "},null,null,"B-1.5"]
[null,null,"",null,null,null,null,{"$f":"IF(G20=\"\",\"\",G20)","v":""},"",null,"E-1.7","Capital Outlay",6200,{"$f":"SUMIF($B$10:$B$140,$S17,E$10:E$140)","v":0},{"$f":"SUMIF($B$10:$B$140,$S17,F$10:F$140)","v":0},{"$f":"SUMIF($B$10:$B$140,$S17,G$10:G$140)","v":0},{"$f":"SUMIF($B$10:$B$140,$S17,H$10:H$140)","v":0},{"$f":"SUMIF($B$10:$B$140,$S17,I$10:I$140)","v":0},{"$f":"CONCATENATE(K24,\" \",L24)","v":"C-4.9 Reserves "},null,"B-1.6","B-1.6"]
{"$rows_left_out":189}
{"sheet":"Notes","index":6,"n_rows":0,"n_cols":0,"rows_kept":0,"cut":false,"hidden":false,"merged":[]}

{"sheet":"Tasks","index":7,"n_rows":20,"n_cols":10,"rows_kept":20,"cut":false,"hidden":true,"merged":[]}
[]
[null,null,null,null,null,null,null,null,null,"Budget Form Development Tasks:"]
[]
[null,null,null,null,null,null,null,null,"ü","Fix Broken formulas"]
[null,null,null,null,null,null,null,null,"ü","Fix broken macro"]
[null,null,null,null,null,null,null,null,"ü","Redo Contents Box (to the left)"]
[]
[null,null,null,null,null,null,null,null,"ü","Add Cash sections"]
[]
[null,null,null,null,null,null,null,null,null,"Amended option?"]
[null,null,null,null,null,null,null,null,"ü","mark as different"]
[null,null,null,null,null,null,null,null,"ü","equal approved column"]
[]
[null,null,null,null,null,null,null,null,"ü","Change line numbers"]
[null,null,null,null,null,null,null,null,"ü","Update line numbers to additional Details page"]
[]
[]
[null,null,null,null,null,null,null,null,"ü","lock/unlock cells"]
[]
[null,null,null,null,null,null,null,null,null,"hyperlinks on go to menu"]
{"$rows_left_out":1}
{"sheet":"Formula Map","index":8,"n_rows":0,"n_cols":0,"rows_kept":0,"cut":false,"hidden":true,"merged":[]}

{"sheet":"Sheet1","index":9,"n_rows":0,"n_cols":0,"rows_kept":0,"cut":false,"hidden":false,"merged":[]}